{"text_format":"1","workbook":"xlsx","n_sheets":6,"sheets":["PLANTILLA","IMPORTANTE","ESTRUCTURA CORE","Tipo y subtipo cotizantes","Subsistemas x Tipo de Pago","TABLAS"],"not_rendered":{"charts":0,"images":8,"macros":1,"external_links":0,"defined_names":36,"comments":1,"pivot_tables":0},"unopened":[],"bounds":{"document_bytes":16777216,"sheet_cells":100000,"rows_first":2000,"rows_last":500,"rows_between":2000,"halvings":0,"cell_chars":16384,"cell_head_chars":4096},"cells_cut":0,"cells_raw":0,"read":"whole","date_system":"1900"}

{"sheet":"PLANTILLA","index":0,"n_rows":8,"n_cols":61,"rows_kept":8,"cut":false,"hidden":false,"merged":[[5,1,5,13],[5,14,5,15],[5,17,5,21],[5,22,5,29],[1,23,3,23],[1,24,3,24],[1,25,3,25],[1,27,3,27]]}
[null,"Version 15.1",null,null,{"$f":"IF(E5=1,\"PUBLICA\",\"\")","v":""},null,null,null,null,null,null,null,null,null,null,null,null,null,null,null,null,null,null,null,null,null,null,null,null,null,null,null,null,null,null,null,null,null,null,null,null,null,null,null,null,null,null,null,null,null,null,null,null,null,null,null,null,null,null,".",{"$f":"IFERROR(VLOOKUP(BI3,TABLAS!$AA$4:$AB$103,2,0),IF($A$1=\"UGPP\",\"¿NATURALEZA JURIDICA Y TIPO DE APORTANTE?\",\".\"))","v":"."}]
[null,null,null,null,null,null,null,null,null,null,null,null,null,null,null,null,null,null,null,null,null,null,null,{"$f":"IF(AND(SUM(X8:X1000000)>0,IFERROR(HLOOKUP(\"TP INCAPACIDAD\",$BI$3:$XFD$3,1,0),1)=1),\"Recuerde ingresar la columna con  TIPO DE PAGO Incapacidades y registrar los valores por este concepto\",\"\")","v":""},{"$f":"IF(AND(SUM(Y8:Y1000000)>0,IFERROR(HLOOKUP(\"TP INCAPACIDAD\",$BI$3:$XFD$3,1,0),1)=1),\"Recuerde ingresar la columna con  TIPO DE PAGO Incapacidades y registrar los valores por este concepto\",\"\")","v":""},{"$f":"IF(AND(SUM(Z8:Z1000000)>0,IFERROR(HLOOKUP(\"TP LICENCIA REMUNERADA\",$BI$3:$XFD$3,1,0),1)=1),\"Recuerde ingresar la columna con  TIPO DE PAGO Permiso o licencia remunerada y registrar los valores por este concepto\",\"\")","v":""},null,{"$f":"IF(AND(SUM(AB8:AB1000000)>0,IFERROR(HLOOKUP(\"TP VACACIONES\",$BI$3:$XFD$3,1,0),1)=1),\"Recuerde ingresar la columna con  TIPO DE PAGO Vacaciones y registrar los valores por este concepto\",\"\")","v":""},null,null,null,null,null,null,null,null,null,null,null,null,null,null,null,null,null,null,null,null,null,null,null,null,null,null,null,null,null,null,null,"CAMPO RESERVADO PARA LA UGPP"]
[null,null,null,null,{"$f":"IF(E5=1,\"Publica\",\"No Publica\")","v":"No Publica"},{"$f":"IFERROR(VLOOKUP(E5&F5,TABLAS!R4:S40,2,0),\"\")","v":""},null,null,null,null,null,null,null,null,null,null,null,null,null,null,null,null,null,null,null,null,null,null,null,null,null,null,null,null,null,null,null,null,null,null,null,null,null,null,null,null,null,null,null,null,null,null,null,null,null,null,null,null,null,"TIPO DE PAGO"]
[null,"TIPO DOCUMENTO APORTANTE","NUMERO DOCUMENTO APORTANTE","RAZON SOCIAL","NATURALEZA JURIDICA","TIPO DE APORTANTE","CAMPO RESERVADO PARA LA UGPP","SUJETO PASIVO DEL IMPUESTO SOBRE LA RENTA PARA LA EQUIDAD CREE","CAMPO RESERVADO PARA LA UGPP","CAMPO RESERVADO PARA LA UGPP",null,null,null,null,null,null,null,null,null,null,null,null,null,null,null,null,null,null,null,null,null,null,null,null,null,null,null,null,null,null,null,null,null,null,null,null,null,null,null,null,null,null,null,null,null,null,null,null,null,"CAMPO RESERVADO PARA LA UGPP"]
[null,null,null,null,null,null,null,null,null,null,null,null,null,null,null,null,null,null,null,null,null,null,null,null,null,null,null,null,null,null,null,null,null,null,null,null,null,null,null,null,null,null,null,null,null,null,null,null,null,null,null,null,null,null,null,null,null,null,null,"CAMPO RESERVADO PARA LA UGPP",{"$f":"IF($A$1=\"UGPP\",IFERROR(VLOOKUP(BI3,TABLAS!$AA$4:$AC$103,3,0),IF($A$1=\"UGPP\",\"¿TIPO DE PAGO?\",\"\")), \"\")","v":""}]
[null,"Datos básicos del trabajador o asociado",null,null,null,null,null,null,null,null,null,null,null,null,"Periodo nómina",null,null,"Novedades",null,null,null,null,"Reporte de días",null,null,null,null,null,null,null,null,null,null,null,null,null,null,null,null,null,null,null,null,null,null,null,null,null,null,null,null,null,null,null,null,null,null,null,null,"cuenta contable"]
{"$rows_left_out":3}
{"sheet":"IMPORTANTE","index":1,"n_rows":0,"n_cols":0,"rows_kept":0,"cut":false,"hidden":true,"merged":[]}

{"sheet":"ESTRUCTURA CORE","index":2,"n_rows":9,"n_cols":153,"rows_kept":9,"cut":false,"hidden":true,"merged":[]}
[null,null,null,null,null,null,null,null,null,null,null,null,null,null,null,null,null,null,null,null,null,null,null,null,null,null,null,null,null,null,null,null,null,null,null,null,null,null,null,null,null,null,null,null,null,"justificacion cambio de la UGPP","(SOLO INTERNO UGPP) Campo libre alfanumérico que lo debe llenar el auditor antes de realizar el cargue de la nómina al CORE"]
[null,null,null,null,null,null,null,null,null,null,null,null,null,null,null,null,null,null,null,null,null,null,null,null,null,null,null,null,null,null,null,null,null,null,null,null,null,null,null,null,null,null,null,null,null,"TIPO DE PAGO UGPP","(SOLO INTERNO UGPP) Tipo de pago: obligatorio puede ser: TP SALARIAL; TP NO SALARIAL; TP NO SALARIAL MARCADO SALARIAL POR LA UGPP; TP COMPENSACIÓN ORDINARIA; TP COMPENSACIÓN EXTRAORDINARIA; TP NO COMPENSACIÓN; TP NO COMPENSACIÓN MARCADA COMO COMP.EXTRAORDINARIA; TP INCAPACIDAD; TP VACACIONES; TP VACACIONES TERMINACION DE CONTRATO; TP LICENCIA REMUNERADA; TP NO SALARIAL PUBLICA; TP NO SALARIAL PUBLICA NO ACEPTADO UGPP; TP CONTRATISTA; TP NO CONTRATISTA\n\n* Con la tabla ubicada en la hoja \"Subsistemás x Tipo de Pago\" Validar que el \"TIPO DE PAGO UGPP\" corresponda al \"TIPO DE APORTANTE\"  y  \"NATURALEZA JURIDICA\"."]
[null,"TIPO DOCUMENTO APORTANTE","número DOCUMENTO APORTANTE","RAZON SOCIAL","NATURALEZA JURIDICA","TIPO DE APORTANTE","APORTA ESAP Y MEN","SUJETO PASIVO DEL IMPUESTO SOBRE LA RENTA PARA LA EQUIDAD CREE","ID_EXPEDIENTE","TIPO DE ACTO",null,null,null,null,null,null,null,null,null,null,null,null,null,null,null,null,null,null,null,null,null,null,null,null,null,null,null,null,null,null,null,null,null,null,null,"NOMBRE CONCEPTO UGPP","(SOLO INTERNO UGPP) Obligatorio, pueden ser uno de las siguientes opciones, teniendo en cuenta la tabla ubicada en la hoja \"Subsistemás x Tipo de Pago\" Validar que el \"NOMBRE CONCEPTO UGPP\" corresponda al \"TIPO DE PAGO UGPP\" :\nSUELDOS\nAPOYO SOSTENIMIENTO\nCOMISIONES\nHORAS EXTRAS\nBONIFICACIONES\nPRImás\nVIATICOS\nAUXILIOS\nVACACIONES\nVACACIONES TERMINACION DE CONTRATO\nINCAPACIDADES\nLICENCIA REMUNERADA\nCOMP. ORDINARIA\nCOMP. EXTRAORDINARIA\nOTROS PAGOS"]
[null,"Campo Obligatorio.  CC, CE, TI, PA, NI","Campo Obligatorio.  numérico en caso de que el documento contenga letras, solo se registraran los números","Campo Obligatorio.  Nombre del aportante","Campo Obligatorio:  \n1 Pública\n2 Privada\n3 Mixta\n4 Organismos multilaterales\n5 Entidades de derecho público no sometidas a la legislación colombiana","Campo Obligatorio.  \n1 Empleador.\n2 Independiente.\n3 Entidades o Universidades Públicas con régimen especial en Salud.\n4 Agremiaciones o asociaciones.\n5 Cooperativas y Precooperativas de Trabajo Asociado\n6 Misiones diplomáticas, consulares o de organismos multilaterales no sometidos a la legislación colombiana.\n7 Organizaciones Administradoras del Programa de Hogares de Bienestar.\n8 Pagador de aportes de los concejales municipales o distritales.","Aplica solo para empresas públicas ver (celda E4) \"1 Pública\" ; si existe una marca \"X\" el porcentaje del SENA  debe ser del 0,5%","Selección obligatorio para empresas privadas y de economia mixta,  ver (celda E4) \"2 Privada\" y \"3 Mixta\" Se selecciona \"SI\" o \"NO\"  de acuerdo si el aportante tiene la calidad de sujetos pasivos del impuesto sobre la renta para la equidad – CREE.\n","(SOLO INTERNO UGPP) \nnúmero del expediente","(SOLO INTERNO UGPP)\n\nREQUERIMIENTO\nAMPLIACIÓN\nLIQUIDACIÓN\nRECURSO",null,null,null,null,null,null,null,null,null,null,null,null,null,null,null,null,null,null,null,null,null,null,null,null,null,null,null,null,null,null,null,null,null,null,null,"Subsistema Asociado","(SOLO INTERNO UGPP) Subsistema asociado: 1 Salud ; 2 Pension ; 3 ARL ; 4 CCF; 5 SENA ; 6 ICBF\n\n* Con base a la tabla ubicada en la hoja \"Subsistemás x Tipo de Pago\"  el validador creará una secuencia de números separados por punto y coma \";\" correspondientes a cada uno de los subsistemás en los cuales se debe sumar el pago,  ejemp:  1;2;3;4;5;6;7   o   1;2    o    5;6;7\n* En el caso de que el \"TIPO DE PAGO UGPP\" sea \"TP NO SALARIAL PUBLICA NO ACEPTADO UGPP\" por tratarse de un pago que puede verse afectado por varias normás especificas para cada entidad, el validador no creara ningun tipo de lista, lo unico que validara es que la información registrada sea una lista de números entre 1 y 6 separados por punto y coma \";\" o vacio\n \nEsto quiere decir que el concepto de pago relacionado en cada columna debe sumarse en los IBCs de cada subsistema de acuerdo a lo relacionado en este campo, ejemplo: si en este campo esta registrado 5;6;7 quiere decir que los valores registrados en esta columna deben sumarse a los subsistemás de ICBF, SENA y Caja de Compensacion Familiar",null,null,null,null,null,null,null,null,null,null,null,null,null,null,null,null,null,null,null,null,null,null,null,null,null,555,null,null,null,null,null,null,null,null,null,null,null,null,null,null,null,null,null,null,null,null,null,null,null,null,null,555,null,null,null,null,null,null,5555,55,null,null,null,null,null,null,null,null,null,null,null,null,5555]
[null,null,null,null,null,null,null,null,null,null,null,null,null,null,null,null,null,null,null,null,null,null,null,null,null,null,null,null,null,null,null,null,null,null,null,null,null,null,null,null,null,null,null,null,null,"cuenta contable","Obligatorio, campo numérico y que permita el carácter especial de punto y coma \";\" "]
["ORDEN","TIPO COTIZANTE","SUBTIPO COTIZANTE","CONDICION ESPECIAL EMPRESA","EXTRANJERO NO OBLIGADO A COTIZAR PENSION","COLOMBIANO EN EL EXTERIOR","ACTIVIDAD ALTO RIESGO PENSION","TIPO DOCUMENTO ACTUAL DEL COTIZANTE","número DOCUMENTO ACTUAL DEL COTIZANTE","TIPO DOCUMENTO CON EL QUE REALIZO APORTES DEL COTIZANTE","número DOCUMENTO CON EL QUE REALIZO APORTES DEL COTIZANTE","NOMBRE COTIZANTE","CARGO DEL TRABAJADOR","AÑO","MES","SALARIO INTEGRAL","NOVEDAD INCAPACIDAD","NOVEDAD LIC.MATERNIDAD O PATERNIDAD","NOVEDAD DE PERMISO O LICENCIA REMUNERADA","NOVEDAD DE SUSPENSIÓN","NOVEDAD VACACIONES","NÚMERO DÍAS TRABAJADOS EN EL MES","NÚMERO DÍAS INCAPACIDADES EN EL MES","NÚMERO DÍAS LICENCIA DE MATERNIDAD O PATERNIDAD","NÚMERO DÍAS DE PERMISO O LICENCIA  REMUNERADAS EN EL MES","NÚMERO DÍAS DE SUSPENSIÓN, PERMISO O LICENCIA  NO REMUNERADAS EN EL MES","NÚMERO DE DÍAS VACACIONES DISFRUTADAS EN EL MES","NÚMERO DÍAS DE HUELGA LEGALMENTE DECLARADA","TOTAL DÍAS REPORTADOS EN EL MES","INGRESO","FECHA ING","RETIRO","FECHA RET","cálculo ACTUARIAL","VALOR cálculo ACTUARIAL","SALARIO BASICO","IBC EN CONCURRENCIA DE INGRESOS CON OTROS APORTANTES","OBSERVACIONES APORTANTE","OBSERVACIONES UGPP","OBSERVACIONES APORTANTE SALUD","OBSERVACIONES APORTANTE PENSION","OBSERVACIONES APORTANTE ARL","OBSERVACIONES APORTANTE CCF","OBSERVACIONES APORTANTE SENA","OBSERVACIONES APORTANTE ICBF","NOMBRE CONCEPTO DE PAGO APORTANTE","Obligatorio, no aplicar ninguna validación,  el nombre del concepto de pago como nos lo reporta el aportante en la nómina","cálculo IBC PERMISOS REMUNERADOS","cálculo IBC SUSPENSIONES O PERMISOS NO REMUNERADOS","cálculo IBC VACACIONES","cálculo IBC HUELGA","días_cot_pension  ","días_cot_salud","días_cot_rprof  ","días_cot_ccf  ","TOTAL PAGOS NO SALARIALES","TOTAL REMUNERADO","PORCENTAJE PAGOS NO SALARIALES","EXCEDENTE LIMITE PAGO NO SALARIAL","código ADMINISTRADORA SALUD","Nombre corto administradora SALUD","IBC PAGOS EN nómina SALUD","TOTAL IBC CALCULADO SALUD","TARIFA SALUD","TARIFA SALUD PARA SUSPENSIONES","cotización OBLIGATORIA CALCULADA SALUD","días COTIZADOS PILA SALUD","IBC pila SALUD","TARIFA PILA SALUD","cotización PAGADA PILA SALUD","AJUSTE SALUD","CONCEPTO AJUSTE SALUD","TIPO DE INCUMPLIMIENTO SALUD","ANALISIS COMPARATIVO CON ETAPA ANTERIOR SALUD","código ADMINISTRADORA PENSIÓN","Nombre corto Administradora PENSIÓN","IBC PAGOS EN nómina PENSIÓN","TOTAL IBC CALCULADO PENSIÓN","TARIFA PENSIÓN","cotización OBLIGATORIA PENSIÓN","días COTIZADOS PILA PENSIÓN","IBC pila PENSIÓN","TARIFA PILA PENSIÓN","cotización PAGADA PILA PENSIÓN","AJUSTE PENSIÓN","CONCEPTO AJUSTE PENSION","TIPO DE INCUMPLIMIENTO PENSIÓN","ANALISIS COMPARATIVO CON ETAPA ANTERIOR PENSION","TARIFA FSP Subcuenta de solidaridad","TARIFA FSP Subcuenta de Subsistencia","cotización OBLIGATORIA FSP Subcuenta de solidaridad","cotización OBLIGATORIA FSP Subcuenta de Subsistencia","cotización PAGADA PILA FSP Subcuenta de solidaridad","cotización PAGADA PILA FSP Subcuenta de Subsistencia","AJUSTE FSP Subcuenta de Solidaridad","AJUSTE FSP Subcuenta de Subsistencia","CONCEPTO AJUSTE FSP","TIPO DE INCUMPLIMIENTO FSP","ANALISIS COMPARATIVO CON ETAPA ANTERIOR FSP","TARIFA PENSIÓN ADICIONAL ACT. ALTO RIESGO","cotización OBLIGATORIA ADICIONAL ACT. ALTO RIESGO","TARIFA PILA PENSIÓN ADICIONAL ACT. ALTO RIESGO","cotización PAGADA PILA PENSIÓN ADICIONAL ACT. ALTO RIESGO","AJUSTE PENSIÓN ADICIONAL ACT. ALTO RIESGO","CONCEPTO AJUSTE PENSIÓN ADICIONAL ACT. ALTO RIESGO","TIPO DE INCUMPLIMIENTO PENSIÓN ADICIONAL ACT. ALTO RIESGO","ANALISIS COMPARATIVO CON ETAPA ANTERIOR ALTO RIESGO","cálculo ACTUARIAL (valor actualizado)","código ADMINISTRADORA ARL","Nombre Corto ADMINISTRADORA ARL","IBC ARL","TARIFA ARL","cotización OBLIGATORIA ARL","días COTIZADOS PILA ARL","IBC pila ARL","TARIFA PILA ARL","cotización PAGADA PILA ARL","AJUSTE ARL","CONCEPTO AJUSTE ARL","TIPO DE INCUMPLIMIENTO ARL","ANALISIS COMPARATIVO CON ETAPA ANTERIOR ARL","código ADMINISTRADORA CCF","Nombre corto administradora CCF","IBC CCF","TARIFA CCF","cotización OBLIGATORIA CCF","días COTIZADOS PILA CCF","IBC pila CCF","TARIFA PILA CCF","cotización PAGADA PILA CCF","AJUSTE CCF","CONCEPTO AJUSTE CCF","TIPO DE INCUMPLIMIENTO CCF","ANALISIS COMPARATIVO CON ETAPA ANTERIOR CCF","IBC SENA","TARIFA SENA","cotización OBLIGATORIA SENA","TARIFA PILA SENA","cotización PAGADA PILA SENA","AJUSTE SENA","CONCEPTO AJUSTE SENA","TIPO DE INCUMPLIMIENTO SENA","ANALISIS COMPARATIVO CON ETAPA ANTERIOR SENA","IBC ICBF","TARIFA ICBF","cotización OBLIGATORIA ICBF","TARIFA PILA ICBF","cotización PAGADA PILA ICBF","AJUSTE ICBF","CONCEPTO AJUSTE ICBF","TIPO DE INCUMPLIMIENTO ICBF","ANALISIS COMPARATIVO CON ETAPA ANTERIOR ICBF","PLANILLAS PILA CARGADA"]
{"$rows_left_out":4}
{"sheet":"Tipo y subtipo cotizantes","index":3,"n_rows":192,"n_cols":13,"rows_kept":192,"cut":false,"hidden":true,"merged":[[38,0,39,0],[38,1,39,1],[38,2,38,11],[2,0,2,9],[3,0,4,0],[3,1,4,1],[3,2,3,9],[37,0,37,11],[130,0,130,1],[162,0,162,1],[175,0,175,1],[184,0,184,1],[72,0,72,12],[73,0,74,0],[73,1,74,1],[73,2,73,12],[107,0,107,2],[121,0,121,1]]}
[]
[]
["Tabla 17. R10- Regla de validación – Tipo de Cotizante  Vs Subsistema al que aporta"]
["TIPO COTIZANTE","CODIGO","SUBSISTEMA"]
[null,null,"SALUD","PENSION","ALTO RIESGO","FSP","ARP","CCF","ICBF","SENA"]
["DEPENDIENTE",1,"X","X","X","X","X","X","X","X",null,null,{"$f":"B6&\". \"&A6","v":"1. DEPENDIENTE"}]
{"$rows_left_out":187}
{"sheet":"Subsistemas x Tipo de Pago","index":4,"n_rows":20,"n_cols":13,"rows_kept":20,"cut":false,"hidden":true,"merged":[]}
[]
[]
[null,null,null,null,"SUBSISTEMAS"]
[null,"NATURALEZA JURIDICA","TIPO DE APORTANTE","TIPO DE PAGO UGPP","SALUD","PENSION","RIESGOS LABORALES","CAJA DE COMPENSACION","SENA","ICBF","NOMBRE CONCEPTO UGPP"]
[null,"1 Pública\n2 Privada\n3 Mixta\n4 Organismos multilaterales\n5 Entidades de derecho público no sometidas a la legislación colombiana","1 Empleador.\n2 Independiente.\n3 Entidades o Universidades Públicas con régimen especial en Salud.\n4 Agremiaciones o asociaciones.\n5 Cooperativas y Precooperativas de Trabajo Asociado\n6 Misiones diplomáticas, consulares o de organismos multilaterales no sometidos a la legislación colombiana.\n7 Organizaciones Administradoras del Programa de Hogares de Bienestar.\n8 Pagador de aportes de los concejales municipales o distritales.\n9 Pagador de aportes contrato sindical","TP SALARIAL",1,2,3,4,5,6,"SUELDOS\nAPOYO SOSTENIMIENTO\nCOMISIONES\nHORAS EXTRAS\nBONIFICACIONES\nPRIMAS\nVIATICOS\nAUXILIOS\nOTROS PAGOS",null,"1;2;3;4;5;6"]
[null,"2 Privada\n3 Mixta\n4 Organismos multilaterales\n5 Entidades de derecho público no sometidas a la legislación colombiana","1 Empleador.\n2 Independiente.\n3 Entidades o Universidades Públicas con régimen especial en Salud.\n4 Agremiaciones o asociaciones.\n5 Cooperativas y Precooperativas de Trabajo Asociado\n6 Misiones diplomáticas, consulares o de organismos multilaterales no sometidos a la legislación colombiana.\n7 Organizaciones Administradoras del Programa de Hogares de Bienestar.\n8 Pagador de aportes de los concejales municipales o distritales.\n9 Pagador de aportes contrato sindical","TP NO SALARIAL",null,null,null,null,null,null,"BONIFICACIONES\nPRIMAS\nVIATICOS\nAUXILIOS\nOTROS PAGOS"]
{"$rows_left_out":15}
{"sheet":"TABLAS","index":5,"n_rows":119,"n_cols":33,"rows_kept":119,"cut":false,"hidden":true,"merged":[]}
[]
[]
[]
["TIPO DOCUMENTO APORTANTE","NATURALEZA JURIDICA","TIPO DE APORTANTE","APORTA ESAP Y MEN","SUJETO PASIVO DEL IMPUESTO SOBRE LA RENTA PARA LA EQUIDAD CREE","TIPO DE ACTO","TIPO COTIZANTE","SUBTIPO COTIZANTE","CONDICION ESPECIAL EMPRESA","EXTRANJERO NO OBLIGADO A COTIZAR PENSION","COLOMBIANO EN EL EXTERIOR","ACTIVIDAD ALTO RIESGO PENSION","TIPO DOCUMENTO ACTUAL DEL COTIZANTE","AÑO","MES","SALARIO INTEGRAL",null,"LLAVE","GRUPO",null,"NATURALEZA JURIDICA","TIPO DE APORTANTE","LLAVE","GRUPO","TIPO DE PAGO UGPP",null,"TIPO DE PAGO UGPP","GRUPO TP","SUBSISTEMAS",null,"TIPO DE PAGO UGPP","GRUPO TP","NOMBRE CONCEPTO UGPP"]
[null,null,null,null,null,null,null,null,null,null,null,null,null,null,null,null,null,"11","PublicaEmp",null,"1 Pública","1 Empleador.",11,"PublicaEmp","TP SALARIAL","Y5","TP SALARIAL","SAL","1;2;3;4;5;6",null,"TP SALARIAL","SAL","SUELDOS"]
["CC",1,1,"X","SI","REQUERIMIENTO",1,0,"LEY 590/2000 AÑO 1","X","X","X","CC",2007,1,"X",null,"13","PublicaUniv",null,"1 Pública","1 Empleador.",11,"PublicaEmp","TP INCAPACIDAD","Y6","TP NO SALARIAL MARCADO SALARIAL POR LA UGPP","NOSALX","1;2;3;4;5;6",null,"TP SALARIAL","SAL","APOYO SOSTENIMIENTO"]
{"$rows_left_out":113}